voûte à nervures multiples
created: 2013-05-21T17:38:41+02:00
modified: 2016-03-29T16:43:22+02:00
status: 1
type: Concept
broader: T66-9
definition: Voûte à nervures appareillée comme une voûte à arêtes doubles ou triples, comme une voûte en berceau à lunettes ou suivant une forme plus complexe à nombreux voutains.
in scheme: T66
narrower: T66-17
narrower: T66-18
preferred label: ribbed vault @en