voûte nervurée appareillée comme la voûte à arêtes triples
created: 2013-05-21T17:38:41+02:00
modified: 2016-03-29T16:55:45+02:00
status: 1
type: Concept
broad match: http://data.bnf.fr/ark:/12148/cb167689198
broad match: http://vocab.getty.edu/aat/300001393
broader: T66-16
definition: Voûte dans laquelle les tiercerons et les ogives sont en place des arêtes ; chaque canton y est formé d'une lunette et de deux voûtains.
in scheme: T66