voûte en berceau
created: 2013-05-21T17:38:41+02:00
modified: 2016-03-30T13:35:44+02:00
status: 1
type: Concept
broader: T66-1
definition: Voûte dont l'intrados est engendré par la translation d'une génératrice suivant une directrice. La voûte en berceau se distingue de l'arc par le fait qu'elle présente au moins quatre voussoirs en profondeur ou plusieurs rouleaux d'intrados.
in scheme: T66
narrower: T66-22
narrower: T66-23
narrower: T66-24
narrower: T66-25
narrower: T66-26
preferred label: barrel vault @en