voûte en berceau segmentaire
created: 2013-05-21T17:38:41+02:00
modified: 2016-03-30T17:46:34+02:00
status: 1
type: Concept
broad match: cb12502346x
broad match: Voûte en berceau
broad match: http://vocab.getty.edu/aat/300001363
broader: T66-21
definition: Voûte surbaissée, dont la génératrice est un segment inférieur au demi-cercle.
in scheme: T66