voûte en berceau en anse-de-panier
created: 2013-05-21T17:38:41+02:00
modified: 2016-03-30T15:44:25+02:00
status: 1
type: Concept
broad match: cb12502346x
broader: T66-21
definition: Voûte surbaissée affectant le tracé d'une demi-ellipse, la portée étant le plus grand diamètre de l'ellipse. Les voûtes en berceau en anse-de-panier ont un nombre impair de centres.
in scheme: T66
preferred label: basket-handle vault @en