voûte en demi-berceau
created: 2013-05-21T17:38:41+02:00
modified: 2016-03-31T12:29:08+02:00
status: 1
type: Concept
broad match: Voûte en berceau
broader: T66-21
definition: Voûte en berceau qui n'a qu'une retombée.
in scheme: T66
preferred label: half barrel vault @en