voûte en pendentifs
created: 2013-05-21T17:38:41+02:00
modified: 2016-03-31T12:59:45+02:00
status: 1
type: Concept
broader: T66-1
definition: Coupole en pendentifs très fortement surbaissée qui, de ce fait, n'évoque plus les formes habituelles de la coupole.
in scheme: T66