voûte plate
created: 2013-05-21T17:38:41+02:00
modified: 2016-03-31T13:12:52+02:00
status: 1
type: Concept
broader: T66-1
definition: Voûte dont la surface inférieure est un plafond et non un intrados.
in scheme: T66