fausse voûte
created: 2013-05-21T17:38:41+02:00
modified: 2016-03-31T14:24:55+02:00
status: 1
type: Concept
definition: Couvrement non maçonné (plâtre sur lattis, lambris peint en fausse voûte, etc.) imitant les dispositions et donnant l'illusion complète d'une voûte.
in scheme: T66
narrower: T66-31
narrower: T66-36
narrower: T66-44
narrower: T66-50
narrower: T66-51
narrower: T66-52
narrower: T66-53
narrower: T66-54