fausse coupole en pendentifs
created: 2013-05-21T17:38:41+02:00
modified: 2016-03-31T14:35:15+02:00
status: 1
type: Concept
alternative label: fausse coupole sur pendentifs
broader: T66-32
definition: Fausse coupole tracée sur la même courbe que ses pendentifs (trompes dont l'intrados est un triangle sphérique concave) : elle paraît formée par des pendentifs prolongés jusqu'au faîte.
in scheme: T66