fausse voûte à cantons
created: 2013-05-21T17:38:41+02:00
modified: 2016-03-31T14:46:54+02:00
status: 1
type: Concept
broader: T66-30
definition: Fausse voûte composée de cantons (parties de voûtes comprises entre deux arêtes saillantes convergeant vers la clef ou entre deux branches d'ogive).
in scheme: T66
narrower: T66-37
narrower: T66-38
narrower: T66-41
narrower: T66-42
narrower: T66-43