fausse voûte à arêtes doubles
created: 2013-05-21T17:38:41+02:00
modified: 2013-05-21T00:00:00+02:00
status: 1
type: Concept
broader: T66-38
definition: Fausse voûte constituée de lunettes séparées les unes des autres par des voûtains triangulaires qui forment avec elles des arêtes doubles convergeant vers les points d'appui. Les arêtes doubles dessinent une étoile autour de la clef de voûte.
in scheme: T66