fausse voûte nervurée appareillée comme la voûte à arêtes doubles
created: 2013-05-21T17:38:41+02:00
modified: 2013-05-21T00:00:00+02:00
status: 1
type: Concept
broader: T66-36
definition: Fausse voûte dans laquelle les tiercerons sont en place des arêtes et les ogives sur le plat des voûtains.
in scheme: T66