fausse voûte nervurée appareillée comme la voûte à arêtes triples
created: 2013-05-21T17:38:41+02:00
modified: 2013-05-21T00:00:00+02:00
status: 1
type: Concept
broader: T66-36
definition: Voûte dans laquelle les tiercerons et les ogives sont en place des arêtes ; chaque canton y est formé d'une lunette et de deux voûtains.
in scheme: T66