fausse voûte en anse-de-panier
created: 2013-05-21T17:38:41+02:00
modified: 2016-03-31T15:40:25+02:00
status: 1
type: Concept
broader: T66-44
definition: Fausse voûte surbaissée affectant le tracé d'une demi-ellipse, la portée étant le plus grand diamètre de l'ellipse.
in scheme: T66