fausse voûte en berceau segmentaire
created: 2013-05-21T17:38:41+02:00
modified: 2016-03-31T15:57:42+02:00
status: 1
type: Concept
broader: T66-44
definition: Fausse voûte surbaissée, dont la génératrice est un segment inférieur au demi-cercle.
in scheme: T66