fausse voûte en cul-de-four
created: 2013-05-21T17:38:41+02:00
modified: 2016-03-31T16:04:17+02:00
status: 1
type: Concept
broader: T66-30
definition: Fausse voûte dont le plan est un segment de cercle et l'intrados une concavité de révolution.
in scheme: T66