charpente apparente
created: 2013-05-21T17:38:41+02:00
modified: 2016-03-31T16:40:37+02:00
status: 1
type: Concept
definition: Ouvrage formant le toit et portant la couverture, dont la structure est visible du sol d'un vaisseau ou d'un étage carré.
in scheme: T66
narrower: T66-58
narrower: T66-59
narrower: T66-60
narrower: T66-61
scope note: ​N'utiliser les descripteurs de la charpente apparente que pour des bâtiments à vaisseaux.