en tas de charge
created: 2013-05-21T17:38:41+02:00
modified: 2016-04-01T14:50:57+02:00
status: 1
type: Concept
broader: T66-62
definition: Tas de charge : appareil des retombées ou, plus rarement, de la totalité d'une voûte, formé d'assises à lits horizontaux en surplomb l'une sur l'autre.
in scheme: T66