cul-de-four
created: 2013-05-21T17:38:41+02:00
modified: 2016-03-29T16:21:11+02:00
status: 1
type: Concept
broader: T66-1
definition: Voûte dont le plan est un segment de cercle et l'intrados une concavité de révolution. Le plan de la voûte en cul-de-four est théoriquement un demi-cercle.
in scheme: T66
preferred label: oven-shaped vault @en