causeEffet
type: ObjectProperty
sub property of: related

actionProduction
type: ObjectProperty
sub property of: related

broaderGeneric
type: ObjectProperty
sub property of: broader
inverse of: narrowerGeneric

narrowerGeneric
type: ObjectProperty
sub property of: narrower
inverse of: broaderGeneric

broaderPartitive
type: ObjectProperty
sub property of: broader
inverse of: narrowerPartitive

narrowerPartitive
type: ObjectProperty
sub property of: narrower
inverse of: broaderPartitive

narrowerInstantive
type: ObjectProperty
sub property of: narrower
inverse of: broaderInstantive

broaderInstantive
type: ObjectProperty
sub property of: broader
inverse of: narrowerInstantive

TermeAssocie
type: ObjectProperty
sub property of: related

CustomConceptAttribute
type: DatatypeProperty

status
type: DatatypeProperty

Type et nature du couvrement - Inventaire/MH
type: ConceptScheme
creator: Inventaire général du patrimoine culturel
publisher: Ministère de la culture et de la communication
description: Vocabulaire contrôlé du champ VOUT du système descriptif de l'architecture. Description des organes ou ouvrages limitant par le haut un entrecolonnement, une baie, une pièce, un vaisseau ou un étage.
modified: 2016-06-01T14:55:26+02:00
type: Liste contrôlée
rights: CC-BY-SA
subject: couvrement
subject: description matérielle
language: fr-FR
language: en
has top concept: béton en couvrement
has top concept: voûte
has top concept: charpente apparente
has top concept: affixes
has top concept: fausse voûte
has top concept: roche en couvrement
has top concept: lambris de couvrement
created: 2013-05-21T17:38:41+02:00
source: Pérouse de Montclos, Jean-Marie, Architecture : description et vocabulaire méthodiques / Inventaire général du patrimoine culturel, Nouvelle éd. , Paris, Éd. du Patrimoine-Centre des monuments nationaux, 2011
issued: Publication
date submitted: 2022-03-17T17:33:55.702+01:00

voûte en berceau plein-cintre
type: Concept
modified: 2016-03-30T15:50:39+02:00
in scheme: Type et nature du couvrement - Inventaire/MH
preferred label: semicircular vault @en
broader: voûte en berceau
created: 2013-05-21T17:38:41+02:00
definition: Voûte dont la génératrice est égale ou sensiblement égale au demi-cercle.
status: 1
broad match: Voûte en berceau

voûte en berceau
type: Concept
modified: 2016-03-30T13:35:44+02:00
in scheme: Type et nature du couvrement - Inventaire/MH
preferred label: barrel vault @en
narrower: voûte en berceau plein-cintre
narrower: voûte en berceau brisé
narrower: voûte en berceau segmentaire
narrower: voûte en berceau en anse-de-panier
narrower: voûte en demi-berceau
broader: voûte
created: 2013-05-21T17:38:41+02:00
definition: Voûte dont l'intrados est engendré par la translation d'une génératrice suivant une directrice. La voûte en berceau se distingue de l'arc par le fait qu'elle présente au moins quatre voussoirs en profondeur ou plusieurs rouleaux d'intrados.
status: 1

semicircular vault
type: PreferredTerm
modified: 2016-03-30T15:50:39+02:00
created: 2016-03-30T15:50:39+02:00
status: 1

voûte en berceau plein-cintre
type: PreferredTerm
modified: 2016-03-30T15:50:39+02:00
created: 2013-05-21T17:38:41+02:00
status: 1

dalle de béton
type: Concept
modified: 2016-04-01T15:46:48+02:00
in scheme: Type et nature du couvrement - Inventaire/MH
broader: béton en couvrement
created: 2013-05-21T17:38:41+02:00
status: 1

béton en couvrement
type: Concept
modified: 2013-05-21T00:00:00+02:00
in scheme: Type et nature du couvrement - Inventaire/MH
narrower: dalle de béton
narrower: voile mince de béton
created: 2013-05-21T17:38:41+02:00
status: 1

dalle de béton
type: PreferredTerm
modified: 2016-04-01T15:46:48+02:00
created: 2013-05-21T17:38:41+02:00
status: 1

fausse voûte nervurée appareillée comme la voûte à arêtes doubles
type: Concept
modified: 2013-05-21T00:00:00+02:00
in scheme: Type et nature du couvrement - Inventaire/MH
broader: fausse voûte à cantons
created: 2013-05-21T17:38:41+02:00
definition: Fausse voûte dans laquelle les tiercerons sont en place des arêtes et les ogives sur le plat des voûtains.
status: 1

fausse voûte à cantons
type: Concept
modified: 2016-03-31T14:46:54+02:00
in scheme: Type et nature du couvrement - Inventaire/MH
narrower: fausse voûte nervurée appareillée comme la voûte à arêtes doubles
narrower: fausse voûte à un quartier
narrower: fausse voûte nervurée appareillée comme la voûte à arêtes triples
narrower: fausse voûte d'arêtes
narrower: fausse voûte d'ogives
broader: fausse voûte
created: 2013-05-21T17:38:41+02:00
definition: Fausse voûte composée de cantons (parties de voûtes comprises entre deux arêtes saillantes convergeant vers la clef ou entre deux branches d'ogive).
status: 1

fausse voûte nervurée appareillée comme la voûte à arêtes doubles
type: PreferredTerm
modified: 2013-05-21T00:00:00+02:00
created: 2013-05-21T17:38:41+02:00
status: 1

fausse voûte à un quartier
type: Concept
modified: 2013-05-21T00:00:00+02:00
in scheme: Type et nature du couvrement - Inventaire/MH
broader: fausse voûte à cantons
created: 2013-05-21T17:38:41+02:00
definition: Fausse voûte de plan triangulaire, constituée par un quartier, dont la corne faîtière est remplacée par un voûtain qui forme la troisième retombée : on peut comparer cette forme à celle d'un quartier dont la corne faîtière aurait été rabattue vers le bas. Lorsque cette voûte est limitée par des doubleaux, l'arête rentrante de la "cassure" du quartier réunit les clefs des deux doubleaux biais. L'arête rentrante est parfois couverte par une lierne.
status: 1

fausse voûte à un quartier
type: PreferredTerm
modified: 2013-05-21T00:00:00+02:00
created: 2013-05-21T17:38:41+02:00
status: 1

cul-de-four
type: Concept
modified: 2016-03-29T16:21:11+02:00
in scheme: Type et nature du couvrement - Inventaire/MH
preferred label: oven-shaped vault @en
broader: voûte
created: 2013-05-21T17:38:41+02:00
definition: Voûte dont le plan est un segment de cercle et l'intrados une concavité de révolution. Le plan de la voûte en cul-de-four est théoriquement un demi-cercle.
status: 1

cul-de-four
type: PreferredTerm
modified: 2016-03-29T16:21:11+02:00
created: 2013-05-21T17:38:41+02:00
status: 1

oven-shaped vault
type: PreferredTerm
modified: 2016-03-29T16:21:11+02:00
created: 2016-03-29T16:18:17+02:00
status: 1

voûte
type: Concept
modified: 2016-03-29T14:39:37+02:00
in scheme: Type et nature du couvrement - Inventaire/MH
preferred label: vault @en
narrower: voûte en berceau
narrower: cul-de-four
narrower: voûte en éventails
narrower: coupole
narrower: voûte à cantons
narrower: voûte de type complexe
narrower: voûte plate
narrower: voûte en pendentifs
narrower: voûte en arc-de-cloître
narrower: voûte en canonnière
created: 2013-05-21T17:38:41+02:00
definition: Ouvrage maçonné (brique, moellon, pierre et pierre de taille, etc.), construit entre des appuis, couvrant un espace et présentant un intrados. Ne pas appeler voûte un couvrement non maçonné.
status: 1

fausse voûte en berceau plein-cintre
type: Concept
modified: 2016-03-31T15:54:53+02:00
in scheme: Type et nature du couvrement - Inventaire/MH
broader: fausse voûte en berceau
created: 2013-05-21T17:38:41+02:00
definition: Fausse voûte dont la génératrice est égale ou sensiblement égale au demi-cercle.
status: 1

fausse voûte en berceau
type: Concept
modified: 2016-03-31T15:34:09+02:00
in scheme: Type et nature du couvrement - Inventaire/MH
narrower: fausse voûte en berceau plein-cintre
narrower: fausse voûte en berceau segmentaire
narrower: fausse voûte en demi-berceau
narrower: fausse voûte en anse-de-panier
narrower: fausse voûte en berceau brisé
broader: fausse voûte
created: 2013-05-21T17:38:41+02:00
definition: Fausse voûte dont l'intrados est engendré par la translation d'une génératrice suivant une directrice.
status: 1

fausse voûte en berceau plein-cintre
type: PreferredTerm
modified: 2016-03-31T15:54:53+02:00
created: 2013-05-21T17:38:41+02:00
status: 1

charpente en bois apparente
type: Concept
modified: 2016-03-31T17:04:22+02:00
in scheme: Type et nature du couvrement - Inventaire/MH
preferred label: open-timbered roof @en
broader: charpente apparente
created: 2013-05-21T17:38:41+02:00
status: 1

open-timbered roof
type: PreferredTerm
modified: 2016-03-31T17:04:22+02:00
created: 2016-03-31T16:55:53+02:00
status: 1

charpente en bois apparente
type: PreferredTerm
modified: 2016-03-31T17:04:22+02:00
created: 2013-05-21T17:38:41+02:00
status: 1

charpente apparente
type: Concept
modified: 2016-03-31T16:40:37+02:00
in scheme: Type et nature du couvrement - Inventaire/MH
narrower: charpente en bois apparente
narrower: charpente en béton armé apparente
narrower: charpente mixte apparente
narrower: charpente métallique apparente
created: 2013-05-21T17:38:41+02:00
scope note: ​N'utiliser les descripteurs de la charpente apparente que pour des bâtiments à vaisseaux.
definition: Ouvrage formant le toit et portant la couverture, dont la structure est visible du sol d'un vaisseau ou d'un étage carré.
status: 1

voûte en éventails
type: Concept
modified: 2016-03-31T12:37:14+02:00
in scheme: Type et nature du couvrement - Inventaire/MH
preferred label: fan vault @en
broader: voûte
created: 2013-05-21T17:38:41+02:00
definition: Voûte à voûtains s'évasant de bas en haut selon un galbe concave. La voûte en éventails a généralement quatre voûtains et est nervurée.
status: 1

fan vault
type: PreferredTerm
modified: 2016-03-31T12:37:14+02:00
created: 2016-03-31T12:37:14+02:00
status: 1

voûte en éventails
type: PreferredTerm
modified: 2016-03-31T12:37:14+02:00
created: 2013-05-21T17:38:41+02:00
status: 1

à lunettes
type: Concept
modified: 2016-04-01T14:34:28+02:00
in scheme: Type et nature du couvrement - Inventaire/MH
broader: affixes
created: 2013-05-21T17:38:41+02:00
definition: Lunette : portion de voûte en berceau, construite dans les montées d'une grande voûte en berceau ou d'une coupole ou entrant dans la composition des voûtes à arêtes doubles, à arêtes triples, de certaines voûtes à nervures multiples. A la différence du quartier, la lunette ne se développe pas jusqu'à la clef de voûte. La lunette à habituellement pour fonction de dégager de la place pour les parties hautes d'une baie, au-dessus de la naissance d'une voûte. Elle est alors en couvrement d'un ébrasement intérieur.
status: 1

affixes
type: Concept
modified: 2013-05-21T00:00:00+02:00
in scheme: Type et nature du couvrement - Inventaire/MH
narrower: à lunettes
narrower: en béton armé
narrower: en brique
narrower: en tas de charge
created: 2013-05-21T17:38:41+02:00
status: 1

à lunettes
type: PreferredTerm
modified: 2016-04-01T14:34:28+02:00
created: 2013-05-21T17:38:41+02:00
status: 1

coupole à trompes
type: Concept
modified: 2016-03-29T15:30:50+02:00
in scheme: Type et nature du couvrement - Inventaire/MH
narrower: coupole en pendentifs
broader: coupole
created: 2013-05-21T17:38:41+02:00
definition: Coupole supportée par de petites voûtes.
status: 1

coupole
type: Concept
modified: 2016-03-29T15:14:11+02:00
in scheme: Type et nature du couvrement - Inventaire/MH
narrower: coupole à trompes
narrower: coupole sans trompe
broader: voûte
created: 2013-05-21T17:38:41+02:00
definition: Voûte de plan centré dont l'intrados est théoriquement une concavité de révolution : il est tracé par la rotation d'une génératrice sur un axe vertical.
status: 1

coupole en pendentifs
type: Concept
modified: 2016-03-29T16:05:54+02:00
in scheme: Type et nature du couvrement - Inventaire/MH
broader: coupole à trompes
alternative label: coupole sur pendentifs
created: 2013-05-21T17:38:41+02:00
definition: Coupole tracée sur la même courbe que ses pendentifs (trompes dont l'intrados est un triangle sphérique concave) : elle paraît formée par des pendentifs prolongés jusqu'au faîte.
status: 1

coupole à trompes
type: PreferredTerm
modified: 2016-03-29T15:30:50+02:00
created: 2013-05-21T17:38:41+02:00
status: 1

fausse voûte en arc-de-cloître
type: Concept
modified: 2016-03-31T15:30:22+02:00
in scheme: Type et nature du couvrement - Inventaire/MH
broader: fausse voûte
created: 2013-05-21T17:38:41+02:00
definition: Fausse voûte constituée de quatre voûtains sur plan carré ou rectangulaire et de même hauteur, dont les rencontres forment des arêtes rentrantes.
status: 1

fausse voûte en arc-de-cloître
type: PreferredTerm
modified: 2016-03-31T15:30:22+02:00
created: 2013-05-21T17:38:41+02:00
status: 1

fausse voûte
type: Concept
modified: 2016-03-31T14:24:55+02:00
in scheme: Type et nature du couvrement - Inventaire/MH
narrower: fausse voûte à cantons
narrower: fausse voûte en berceau
narrower: fausse voûte en arc-de-cloître
narrower: fausse coupole
narrower: fausse voûte en éventails
narrower: fausse voûte en pendentifs
narrower: fausse voûte de type complexe
narrower: fausse voûte en cul-de-four
created: 2013-05-21T17:38:41+02:00
definition: Couvrement non maçonné (plâtre sur lattis, lambris peint en fausse voûte, etc.) imitant les dispositions et donnant l'illusion complète d'une voûte.
status: 1

voûte à arêtes triples
type: Concept
modified: 2016-03-29T17:42:01+02:00
in scheme: Type et nature du couvrement - Inventaire/MH
broader: voûte d'arêtes
created: 2013-05-21T17:38:41+02:00
definition: Voûte constituée de lunettes séparées par des voûtains, formant ensemble des arêtes triples convergeant vers les points d'appui. Elle est donc constituée comme la voûte à arêtes doubles, mais présente une troisième arête médiane qui passe par la clef de voûte, comme les arêtes de la voûte d'arêtes. Ces arête médianes divisent la voûte en cantons, chaque canton étant formé d'une lunette et de deux voûtains.
status: 1
broad match: http://vocab.getty.edu/aat/300001347
broad match: Voûte d'arêtes
broad match: http://data.bnf.fr/ark:/12148/cb167689105

voûte d'arêtes
type: Concept
modified: 2016-03-29T17:20:03+02:00
in scheme: Type et nature du couvrement - Inventaire/MH
preferred label: groined vault @en
narrower: voûte à arêtes triples
narrower: voûte à arêtes doubles
broader: voûte à cantons
created: 2013-05-21T17:38:41+02:00
definition: Voûte constituée de quartiers dont les rencontres forment des arêtes saillantes se recoupant à un faîte commun : la voûte d'arêtes est donc théoriquement le résultat de la pénétration de plusieurs berceaux de même hauteur dont les lignes de faîte restent entières. Elle comprend habituellement quatre quartiers.
status: 1

voûte à arêtes triples
type: PreferredTerm
modified: 2016-03-29T17:42:01+02:00
created: 2013-05-21T17:38:41+02:00
status: 1

voûte en berceau brisé
type: Concept
modified: 2016-03-30T15:21:41+02:00
in scheme: Type et nature du couvrement - Inventaire/MH
broader: voûte en berceau
created: 2013-05-21T17:38:41+02:00
definition: Voûte en berceau à deux segments concaves se rejoignant au faîte. En général, la voûte en berceau brisé n'a pas de clef mais un joint de faîte.
status: 1
broad match: Voûte en berceau
broad match: cb12502346x
broad match: http://vocab.getty.edu/aat/300001363

voûte en berceau brisé
type: PreferredTerm
modified: 2016-03-30T15:21:41+02:00
created: 2013-05-21T17:38:41+02:00
status: 1

fausse coupole à trompes
type: Concept
modified: 2016-03-31T14:33:28+02:00
in scheme: Type et nature du couvrement - Inventaire/MH
narrower: fausse coupole en pendentifs
broader: fausse coupole
created: 2013-05-21T17:38:41+02:00
definition: Fausse coupole supportée par de petites voûtes.
status: 1

fausse coupole
type: Concept
modified: 2016-03-31T14:31:36+02:00
in scheme: Type et nature du couvrement - Inventaire/MH
narrower: fausse coupole à trompes
narrower: fausse coupole sans trompe
broader: fausse voûte
created: 2013-05-21T17:38:41+02:00
definition: Couvrement non maçonné (lambris) affectant la forme d'une coupole.
status: 1

fausse coupole à trompes
type: PreferredTerm
modified: 2016-03-31T14:33:28+02:00
created: 2013-05-21T17:38:41+02:00
status: 1

fausse coupole en pendentifs
type: Concept
modified: 2016-03-31T14:35:15+02:00
in scheme: Type et nature du couvrement - Inventaire/MH
broader: fausse coupole à trompes
alternative label: fausse coupole sur pendentifs
created: 2013-05-21T17:38:41+02:00
definition: Fausse coupole tracée sur la même courbe que ses pendentifs (trompes dont l'intrados est un triangle sphérique concave) : elle paraît formée par des pendentifs prolongés jusqu'au faîte.
status: 1

voûte à cantons
type: Concept
modified: 2016-03-29T16:32:59+02:00
in scheme: Type et nature du couvrement - Inventaire/MH
narrower: voûte d'arêtes
narrower: voûte d'ogives
narrower: voûte à nervures multiples
narrower: voûte à un quartier
broader: voûte
created: 2013-05-21T17:38:41+02:00
definition: Voûte composée de cantons (parties de voûtes comprises entre deux arêtes saillantes convergeant vers la clef ou entre deux branches d'ogive).
status: 1

voûte d'ogives
type: Concept
modified: 2016-03-30T12:40:53+02:00
in scheme: Type et nature du couvrement - Inventaire/MH
preferred label: ogival vault @en
narrower: voûte d'ogives bombée
broader: voûte à cantons
created: 2013-05-21T17:38:41+02:00
definition: Voûte construite sur le plan d'une voûte d'arêtes, mais sans arête, la rencontre des quartiers étant formée par des branches d'ogive. La voûte d'ogives a généralement quatre quartiers.
status: 1

voûte à cantons
type: PreferredTerm
modified: 2016-03-29T16:32:59+02:00
created: 2013-05-21T17:38:41+02:00
status: 1

voûte à nervures multiples
type: Concept
modified: 2016-03-29T16:43:22+02:00
in scheme: Type et nature du couvrement - Inventaire/MH
preferred label: ribbed vault @en
narrower: voûte nervurée appareillée comme la voûte à arêtes triples
narrower: voûte nervurée appareillée comme la voûte à arêtes doubles
broader: voûte à cantons
created: 2013-05-21T17:38:41+02:00
definition: Voûte à nervures appareillée comme une voûte à arêtes doubles ou triples, comme une voûte en berceau à lunettes ou suivant une forme plus complexe à nombreux voutains.
status: 1

voûte à un quartier
type: Concept
modified: 2013-05-21T00:00:00+02:00
in scheme: Type et nature du couvrement - Inventaire/MH
broader: voûte à cantons
created: 2013-05-21T17:38:41+02:00
definition: Voûte de plan triangulaire, constituée par un quartier, dont la corne faîtière est remplacée par un voûtain qui forme la troisième retombée : on peut comparer cette forme à celle d'un quartier dont la corne faîtière aurait été rabattue vers le bas. Lorsque cette voûte est limitée par des doubleaux, l'arête rentrante de la "cassure" du quartier réunit les clefs des deux doubleaux biais. L'arête rentrante est parfois couverte par une lierne. La voûte à un quartier est habituellement employé dans des parties tournantes souvent en alternance avec des voûtes d'ogives.
status: 1

voile mince de béton
type: Concept
modified: 2016-04-01T16:06:07+02:00
in scheme: Type et nature du couvrement - Inventaire/MH
broader: béton en couvrement
created: 2013-05-21T17:38:41+02:00
status: 1

béton en couvrement
type: PreferredTerm
modified: 2013-05-21T00:00:00+02:00
created: 2013-05-21T17:38:41+02:00
status: 1

fausse voûte nervurée appareillée comme la voûte à arêtes triples
type: Concept
modified: 2013-05-21T00:00:00+02:00
in scheme: Type et nature du couvrement - Inventaire/MH
broader: fausse voûte à cantons
created: 2013-05-21T17:38:41+02:00
definition: Voûte dans laquelle les tiercerons et les ogives sont en place des arêtes ; chaque canton y est formé d'une lunette et de deux voûtains.
status: 1

fausse voûte nervurée appareillée comme la voûte à arêtes triples
type: PreferredTerm
modified: 2013-05-21T00:00:00+02:00
created: 2013-05-21T17:38:41+02:00
status: 1

voûte de type complexe
type: Concept
modified: 2016-03-30T12:56:18+02:00
in scheme: Type et nature du couvrement - Inventaire/MH
broader: voûte
created: 2013-05-21T17:38:41+02:00
status: 1

voûte de type complexe
type: PreferredTerm
modified: 2016-03-30T12:56:18+02:00
created: 2013-05-21T17:38:41+02:00
status: 1

fausse voûte en berceau segmentaire
type: Concept
modified: 2016-03-31T15:57:42+02:00
in scheme: Type et nature du couvrement - Inventaire/MH
broader: fausse voûte en berceau
created: 2013-05-21T17:38:41+02:00
definition: Fausse voûte surbaissée, dont la génératrice est un segment inférieur au demi-cercle.
status: 1

fausse voûte en berceau segmentaire
type: PreferredTerm
modified: 2016-03-31T15:57:42+02:00
created: 2013-05-21T17:38:41+02:00
status: 1

fausse voûte d'arêtes
type: Concept
modified: 2016-03-31T15:01:48+02:00
in scheme: Type et nature du couvrement - Inventaire/MH
narrower: fausse voûte à arêtes doubles
narrower: fausse voûte à arêtes triples
broader: fausse voûte à cantons
created: 2013-05-21T17:38:41+02:00
definition: Fausse voûte constituée de quartiers dont les rencontres forment des arêtes saillantes se recoupant à un faîte commun.
status: 1

fausse voûte à arêtes doubles
type: Concept
modified: 2013-05-21T00:00:00+02:00
in scheme: Type et nature du couvrement - Inventaire/MH
broader: fausse voûte d'arêtes
created: 2013-05-21T17:38:41+02:00
definition: Fausse voûte constituée de lunettes séparées les unes des autres par des voûtains triangulaires qui forment avec elles des arêtes doubles convergeant vers les points d'appui. Les arêtes doubles dessinent une étoile autour de la clef de voûte.
status: 1

fausse voûte à arêtes triples
type: Concept
modified: 2013-05-21T00:00:00+02:00
in scheme: Type et nature du couvrement - Inventaire/MH
broader: fausse voûte d'arêtes
created: 2013-05-21T17:38:41+02:00
definition: Fausse voûte constituée de lunettes séparées par des voûtains, formant ensemble des arêtes triples convergeant vers les points d'appui. Elle est donc constituée comme la voûte à arêtes doubles, mais présente une troisième arête médiane qui passe par la clef de voûte, comme les arêtes de la voûte d'arêtes. Ces arête médianes divisent la voûte en cantons, chaque canton étant formé d'une lunette et de deux voûtains.
status: 1

fausse voûte d'arêtes
type: PreferredTerm
modified: 2016-03-31T15:01:48+02:00
created: 2013-05-21T17:38:41+02:00
status: 1

coupole sur pendentifs
type: SimpleNonPreferredTerm
modified: 2016-03-29T16:05:54+02:00
created: 2013-05-21T17:38:41+02:00
status: 1

coupole en pendentifs
type: PreferredTerm
modified: 2016-03-29T16:05:54+02:00
created: 2013-05-21T17:38:41+02:00
status: 1

charpente en béton armé apparente
type: Concept
modified: 2016-03-31T16:52:46+02:00
in scheme: Type et nature du couvrement - Inventaire/MH
broader: charpente apparente
created: 2013-05-21T17:38:41+02:00
status: 1

charpente apparente
type: PreferredTerm
modified: 2016-03-31T16:40:37+02:00
created: 2013-05-21T17:38:41+02:00
status: 1

charpente mixte apparente
type: Concept
modified: 2016-03-31T17:20:50+02:00
in scheme: Type et nature du couvrement - Inventaire/MH
broader: charpente apparente
created: 2013-05-21T17:38:41+02:00
status: 1

charpente métallique apparente
type: Concept
modified: 2016-03-31T17:17:37+02:00
in scheme: Type et nature du couvrement - Inventaire/MH
broader: charpente apparente
created: 2013-05-21T17:38:41+02:00
status: 1

voûte plate
type: Concept
modified: 2016-03-31T13:12:52+02:00
in scheme: Type et nature du couvrement - Inventaire/MH
broader: voûte
created: 2013-05-21T17:38:41+02:00
definition: Voûte dont la surface inférieure est un plafond et non un intrados.
status: 1

voûte plate
type: PreferredTerm
modified: 2016-03-31T13:12:52+02:00
created: 2013-05-21T17:38:41+02:00
status: 1

voûte en pendentifs
type: Concept
modified: 2016-03-31T12:59:45+02:00
in scheme: Type et nature du couvrement - Inventaire/MH
broader: voûte
created: 2013-05-21T17:38:41+02:00
definition: Coupole en pendentifs très fortement surbaissée qui, de ce fait, n'évoque plus les formes habituelles de la coupole.
status: 1

voûte en pendentifs
type: PreferredTerm
modified: 2016-03-31T12:59:45+02:00
created: 2013-05-21T17:38:41+02:00
status: 1

affixes
type: PreferredTerm
modified: 2013-05-21T00:00:00+02:00
created: 2013-05-21T17:38:41+02:00
status: 1

en béton armé
type: Concept
modified: 2013-05-21T00:00:00+02:00
in scheme: Type et nature du couvrement - Inventaire/MH
broader: affixes
created: 2013-05-21T17:38:41+02:00
status: 1

en brique
type: Concept
modified: 2013-05-21T00:00:00+02:00
in scheme: Type et nature du couvrement - Inventaire/MH
broader: affixes
created: 2013-05-21T17:38:41+02:00
status: 1

en tas de charge
type: Concept
modified: 2016-04-01T14:50:57+02:00
in scheme: Type et nature du couvrement - Inventaire/MH
broader: affixes
created: 2013-05-21T17:38:41+02:00
definition: Tas de charge : appareil des retombées ou, plus rarement, de la totalité d'une voûte, formé d'assises à lits horizontaux en surplomb l'une sur l'autre.
status: 1

fausse voûte en éventails
type: Concept
modified: 2013-05-21T00:00:00+02:00
in scheme: Type et nature du couvrement - Inventaire/MH
broader: fausse voûte
created: 2013-05-21T17:38:41+02:00
definition: Fausse voûte à voûtains s'évasant de bas en haut selon un galbe concave.
status: 1

fausse voûte en éventails
type: PreferredTerm
modified: 2013-05-21T00:00:00+02:00
created: 2013-05-21T17:38:41+02:00
status: 1

voûte d'ogives
type: PreferredTerm
modified: 2016-03-30T12:40:53+02:00
created: 2013-05-21T17:38:41+02:00
status: 1

ogival vault
type: PreferredTerm
modified: 2016-03-30T12:40:53+02:00
created: 2016-03-30T12:40:53+02:00
status: 1

voûte d'ogives bombée
type: Concept
modified: 2016-03-30T12:46:27+02:00
in scheme: Type et nature du couvrement - Inventaire/MH
broader: voûte d'ogives
created: 2013-05-21T17:38:41+02:00
definition: Voûte d'ogives à quartiers inclinés, leur ligne de faîte montant vers la clef de voûte.
status: 1
broad match: http://data.bnf.fr/ark:/12148/cb133315699
broad match: Voûte d'ogive

en tas de charge
type: PreferredTerm
modified: 2016-04-01T14:50:57+02:00
created: 2013-05-21T17:38:41+02:00
status: 1

vault
type: PreferredTerm
modified: 2016-03-29T14:39:37+02:00
created: 2016-03-29T14:22:18+02:00
status: 1

voûte
type: PreferredTerm
modified: 2016-03-29T14:39:37+02:00
created: 2013-05-21T17:38:41+02:00
status: 1

voûte en arc-de-cloître
type: Concept
modified: 2016-03-30T13:15:14+02:00
in scheme: Type et nature du couvrement - Inventaire/MH
preferred label: cloister vault @en
broader: voûte
created: 2013-05-21T17:38:41+02:00
definition: Voûte constituée de quatre voûtains sur plan carré ou rectangulaire et de même hauteur, dont les rencontres forment des arêtes rentrantes : la voûte en arc-de-cloître est théoriquement le résultat de la compénétration de deux berceaux de même hauteur en croix dont les naissances rectilignes restent entières.
status: 1

voûte en canonnière
type: Concept
modified: 2016-06-01T14:55:21+02:00
in scheme: Type et nature du couvrement - Inventaire/MH
broader: voûte
alternative label: canonnière
created: 2013-05-21T17:38:41+02:00
status: 1

fausse coupole en pendentifs
type: PreferredTerm
modified: 2016-03-31T14:35:15+02:00
created: 2013-05-21T17:38:41+02:00
status: 1

fausse coupole sur pendentifs
type: SimpleNonPreferredTerm
modified: 2016-03-31T14:35:15+02:00
created: 2013-05-21T17:38:41+02:00
status: 1

voûte en berceau segmentaire
type: Concept
modified: 2016-03-30T17:46:34+02:00
in scheme: Type et nature du couvrement - Inventaire/MH
broader: voûte en berceau
created: 2013-05-21T17:38:41+02:00
definition: Voûte surbaissée, dont la génératrice est un segment inférieur au demi-cercle.
status: 1
broad match: Voûte en berceau
broad match: cb12502346x
broad match: http://vocab.getty.edu/aat/300001363

voûte en berceau segmentaire
type: PreferredTerm
modified: 2016-03-30T17:46:34+02:00
created: 2013-05-21T17:38:41+02:00
status: 1

fausse voûte en pendentifs
type: Concept
modified: 2016-03-31T16:06:03+02:00
in scheme: Type et nature du couvrement - Inventaire/MH
broader: fausse voûte
created: 2013-05-21T17:38:41+02:00
definition: Fausse coupole en pendentifs très fortement surbaissée qui, de ce fait, n'évoque plus les formes habituelles de la coupole.
status: 1

fausse voûte de type complexe
type: Concept
modified: 2016-03-31T15:27:04+02:00
in scheme: Type et nature du couvrement - Inventaire/MH
broader: fausse voûte
created: 2013-05-21T17:38:41+02:00
status: 1

fausse voûte en cul-de-four
type: Concept
modified: 2016-03-31T16:04:17+02:00
in scheme: Type et nature du couvrement - Inventaire/MH
broader: fausse voûte
created: 2013-05-21T17:38:41+02:00
definition: Fausse voûte dont le plan est un segment de cercle et l'intrados une concavité de révolution.
status: 1

fausse voûte
type: PreferredTerm
modified: 2016-03-31T14:24:55+02:00
created: 2013-05-21T17:38:41+02:00
status: 1

fausse coupole sans trompe
type: Concept
modified: 2016-03-31T14:36:12+02:00
in scheme: Type et nature du couvrement - Inventaire/MH
broader: fausse coupole
created: 2013-05-21T17:38:41+02:00
status: 1

fausse coupole sans trompe
type: PreferredTerm
modified: 2016-03-31T14:36:12+02:00
created: 2013-05-21T17:38:41+02:00
status: 1

fausse voûte en demi-berceau
type: Concept
modified: 2013-05-21T00:00:00+02:00
in scheme: Type et nature du couvrement - Inventaire/MH
broader: fausse voûte en berceau
created: 2013-05-21T17:38:41+02:00
definition: Fausse voûte en berceau qui n'a qu'une retombée.
status: 1

fausse voûte en demi-berceau
type: PreferredTerm
modified: 2013-05-21T00:00:00+02:00
created: 2013-05-21T17:38:41+02:00
status: 1

cloister vault
type: PreferredTerm
modified: 2016-03-30T13:15:14+02:00
created: 2016-03-30T13:15:14+02:00
status: 1

voûte en arc-de-cloître
type: PreferredTerm
modified: 2016-03-30T13:15:14+02:00
created: 2013-05-21T17:38:41+02:00
status: 1

fausse voûte à arêtes triples
type: PreferredTerm
modified: 2013-05-21T00:00:00+02:00
created: 2013-05-21T17:38:41+02:00
status: 1

fausse voûte en anse-de-panier
type: Concept
modified: 2016-03-31T15:40:25+02:00
in scheme: Type et nature du couvrement - Inventaire/MH
broader: fausse voûte en berceau
created: 2013-05-21T17:38:41+02:00
definition: Fausse voûte surbaissée affectant le tracé d'une demi-ellipse, la portée étant le plus grand diamètre de l'ellipse.
status: 1

fausse voûte en anse-de-panier
type: PreferredTerm
modified: 2016-03-31T15:40:25+02:00
created: 2013-05-21T17:38:41+02:00
status: 1

fausse voûte à arêtes doubles
type: PreferredTerm
modified: 2013-05-21T00:00:00+02:00
created: 2013-05-21T17:38:41+02:00
status: 1

voûte à un quartier
type: PreferredTerm
modified: 2013-05-21T00:00:00+02:00
created: 2013-05-21T17:38:41+02:00
status: 1

voûte nervurée appareillée comme la voûte à arêtes triples
type: Concept
modified: 2016-03-29T16:55:45+02:00
in scheme: Type et nature du couvrement - Inventaire/MH
broader: voûte à nervures multiples
created: 2013-05-21T17:38:41+02:00
definition: Voûte dans laquelle les tiercerons et les ogives sont en place des arêtes ; chaque canton y est formé d'une lunette et de deux voûtains.
status: 1
broad match: http://data.bnf.fr/ark:/12148/cb167689198
broad match: http://vocab.getty.edu/aat/300001393

voûte nervurée appareillée comme la voûte à arêtes triples
type: PreferredTerm
modified: 2016-03-29T16:55:45+02:00
created: 2013-05-21T17:38:41+02:00
status: 1

roche en couvrement
type: Concept
modified: 2016-03-31T16:27:40+02:00
in scheme: Type et nature du couvrement - Inventaire/MH
created: 2013-05-21T17:38:41+02:00
scope note: Qualifie les édifices ou édicules troglodytiques.
status: 1

roche en couvrement
type: PreferredTerm
modified: 2016-03-31T16:27:40+02:00
created: 2013-05-21T17:38:41+02:00
status: 1

voûte en berceau en anse-de-panier
type: Concept
modified: 2016-03-30T15:44:25+02:00
in scheme: Type et nature du couvrement - Inventaire/MH
preferred label: basket-handle vault @en
broader: voûte en berceau
created: 2013-05-21T17:38:41+02:00
definition: Voûte surbaissée affectant le tracé d'une demi-ellipse, la portée étant le plus grand diamètre de l'ellipse. Les voûtes en berceau en anse-de-panier ont un nombre impair de centres.
status: 1
broad match: cb12502346x

basket-handle vault
type: PreferredTerm
modified: 2016-03-30T15:44:25+02:00
created: 2016-03-30T15:44:25+02:00
status: 1

voûte en berceau en anse-de-panier
type: PreferredTerm
modified: 2016-03-30T15:44:25+02:00
created: 2013-05-21T17:38:41+02:00
status: 1

canonnière
type: SimpleNonPreferredTerm
modified: 2016-06-01T14:55:21+02:00
created: 2013-05-21T17:38:41+02:00
status: 1

voûte en canonnière
type: PreferredTerm
modified: 2016-06-01T14:55:21+02:00
created: 2016-06-01T14:55:21+02:00
status: 1

lambris de couvrement
type: Concept
modified: 2016-03-31T16:18:15+02:00
in scheme: Type et nature du couvrement - Inventaire/MH
created: 2013-05-21T17:38:41+02:00
definition: Revêtement en bois, marbre ou en d'autres matériaux durs, pouvant prendre toutes les formes de voûte.
status: 1

lambris de couvrement
type: PreferredTerm
modified: 2016-03-31T16:18:15+02:00
created: 2013-05-21T17:38:41+02:00
status: 1

charpente mixte apparente
type: PreferredTerm
modified: 2016-03-31T17:20:50+02:00
created: 2013-05-21T17:38:41+02:00
status: 1

fausse voûte en berceau
type: PreferredTerm
modified: 2016-03-31T15:34:09+02:00
created: 2013-05-21T17:38:41+02:00
status: 1

fausse voûte en berceau brisé
type: Concept
modified: 2016-03-31T15:52:18+02:00
in scheme: Type et nature du couvrement - Inventaire/MH
broader: fausse voûte en berceau
created: 2013-05-21T17:38:41+02:00
definition: Fausse voûte en berceau à deux segments concaves se rejoignant au faîte.
status: 1

en brique
type: PreferredTerm
modified: 2013-05-21T00:00:00+02:00
created: 2013-05-21T17:38:41+02:00
status: 1

fausse voûte en pendentifs
type: PreferredTerm
modified: 2016-03-31T16:06:03+02:00
created: 2013-05-21T17:38:41+02:00
status: 1

voûte d'ogives bombée
type: PreferredTerm
modified: 2016-03-30T12:46:27+02:00
created: 2013-05-21T17:38:41+02:00
status: 1

fausse coupole
type: PreferredTerm
modified: 2016-03-31T14:31:36+02:00
created: 2013-05-21T17:38:41+02:00
status: 1

voûte en demi-berceau
type: Concept
modified: 2016-03-31T12:29:08+02:00
in scheme: Type et nature du couvrement - Inventaire/MH
preferred label: half barrel vault @en
broader: voûte en berceau
created: 2013-05-21T17:38:41+02:00
definition: Voûte en berceau qui n'a qu'une retombée.
status: 1
broad match: Voûte en berceau

voûte en berceau
type: PreferredTerm
modified: 2016-03-30T13:35:44+02:00
created: 2013-05-21T17:38:41+02:00
status: 1

barrel vault
type: PreferredTerm
modified: 2016-03-30T13:35:44+02:00
created: 2016-03-30T13:35:44+02:00
status: 1

fausse voûte à cantons
type: PreferredTerm
modified: 2016-03-31T14:46:54+02:00
created: 2013-05-21T17:38:41+02:00
status: 1

fausse voûte d'ogives
type: Concept
modified: 2016-03-31T15:23:19+02:00
in scheme: Type et nature du couvrement - Inventaire/MH
broader: fausse voûte à cantons
created: 2013-05-21T17:38:41+02:00
definition: Fausse voûte construite sur le plan d'une voûte d'arêtes, mais sans arête, la rencontre des quartiers étant formée par des branches d'ogive. La voûte d'ogives a généralement quatre quartiers
status: 1

voûte à arêtes doubles
type: Concept
modified: 2016-03-29T17:31:11+02:00
in scheme: Type et nature du couvrement - Inventaire/MH
broader: voûte d'arêtes
created: 2013-05-21T17:38:41+02:00
definition: Voûte constituée de lunettes séparées les unes des autres par des voûtains triangulaires qui forment avec elles des arêtes doubles convergeant vers les points d'appui. La voûte à arêtes doubles peut donc être considérée comme un cas particulier de voûte d'arêtes dont les berceaux ne se pénétreraient pas. Les arêtes doubles dessinent une étoile autour de la clef de voûte.
status: 1
broad match: http://vocab.getty.edu/aat/300001347
broad match: Voûte d'arêtes
broad match: http://data.bnf.fr/ark:/12148/cb167689105

groined vault
type: PreferredTerm
modified: 2016-03-29T17:20:03+02:00
created: 2016-03-29T17:20:03+02:00
status: 1

voûte d'arêtes
type: PreferredTerm
modified: 2016-03-29T17:20:03+02:00
created: 2013-05-21T17:38:41+02:00
status: 1

fausse voûte en berceau brisé
type: PreferredTerm
modified: 2016-03-31T15:52:18+02:00
created: 2013-05-21T17:38:41+02:00
status: 1

voûte nervurée appareillée comme la voûte à arêtes doubles
type: Concept
modified: 2016-03-29T16:49:18+02:00
in scheme: Type et nature du couvrement - Inventaire/MH
broader: voûte à nervures multiples
created: 2013-05-21T17:38:41+02:00
definition: Voûte dans laquelle les tiercerons sont en place des arêtes et les ogives sur le plat des voûtains.
status: 1
broad match: http://data.bnf.fr/ark:/12148/cb167689198
broad match: http://vocab.getty.edu/aat/300001393

voûte nervurée appareillée comme la voûte à arêtes doubles
type: PreferredTerm
modified: 2016-03-29T16:49:18+02:00
created: 2013-05-21T17:38:41+02:00
status: 1

coupole sans trompe
type: Concept
modified: 2016-03-29T16:12:41+02:00
in scheme: Type et nature du couvrement - Inventaire/MH
broader: coupole
created: 2013-05-21T17:38:41+02:00
status: 1
broad match: Coupole

coupole sans trompe
type: PreferredTerm
modified: 2016-03-29T16:12:41+02:00
created: 2013-05-21T17:38:41+02:00
status: 1

fausse voûte d'ogives
type: PreferredTerm
modified: 2016-03-31T15:23:19+02:00
created: 2013-05-21T17:38:41+02:00
status: 1

fausse voûte de type complexe
type: PreferredTerm
modified: 2016-03-31T15:27:04+02:00
created: 2013-05-21T17:38:41+02:00
status: 1

half barrel vault
type: PreferredTerm
modified: 2016-03-31T12:29:08+02:00
created: 2016-03-31T12:29:08+02:00
status: 1

voûte en demi-berceau
type: PreferredTerm
modified: 2016-03-31T12:29:08+02:00
created: 2013-05-21T17:38:41+02:00
status: 1

charpente en béton armé apparente
type: PreferredTerm
modified: 2016-03-31T16:52:46+02:00
created: 2013-05-21T17:38:41+02:00
status: 1

coupole
type: PreferredTerm
modified: 2016-03-29T15:14:11+02:00
created: 2013-05-21T17:38:41+02:00
status: 1

voûte à arêtes doubles
type: PreferredTerm
modified: 2016-03-29T17:31:11+02:00
created: 2013-05-21T17:38:41+02:00
status: 1

charpente métallique apparente
type: PreferredTerm
modified: 2016-03-31T17:17:37+02:00
created: 2013-05-21T17:38:41+02:00
status: 1

voûte à nervures multiples
type: PreferredTerm
modified: 2016-03-29T16:43:22+02:00
created: 2013-05-21T17:38:41+02:00
status: 1

ribbed vault
type: PreferredTerm
modified: 2016-03-29T16:43:22+02:00
created: 2016-03-29T16:40:46+02:00
status: 1

voile mince de béton
type: PreferredTerm
modified: 2016-04-01T16:06:07+02:00
created: 2013-05-21T17:38:41+02:00
status: 1

fausse voûte en cul-de-four
type: PreferredTerm
modified: 2016-03-31T16:04:17+02:00
created: 2013-05-21T17:38:41+02:00
status: 1

en béton armé
type: PreferredTerm
modified: 2013-05-21T00:00:00+02:00
created: 2013-05-21T17:38:41+02:00
status: 1