chaise de temple
terme associe: T69-812
created: 2012-05-16T00:00:00+02:00
modified: 2014-01-10T00:00:00+01:00
status: 1
type: Concept
broader: T69-999
definition: Il peut s'agir d'une chaise de fidèle protestant, d'une chaise de chantre ou d'une chaise de lecteur, chaise réservée à un lecteur ou à un chantre durant les offices et qui comporte un siège surélevé et incliné pour que l'on puisse paraître debout tout en étant assis.
in scheme: T69
related: T69-812
scope note: Préciser la fonction secondaire exacte dans le champ PDEN.