fauteuil de temple
created: 2012-05-16T00:00:00+02:00
modified: 2014-01-10T00:00:00+01:00
status: 1
type: Concept
broader: T69-999
definition: Fauteuil, parfois d'origine civile, utilisé dans l'enceinte du temple.
in scheme: T69