stalle de temple
terme associe: T69-1001
created: 2012-05-16T00:00:00+02:00
modified: 2014-01-10T00:00:00+01:00
status: 1
type: Concept
alternative label: stalle pastorale
broader: T69-999
definition: Stalle utilisée dans un temple pour asseoir les fidèles ou des conseillers presbytéraux. Elle est destinée parfois au pasteur et entourée d'une grille de bois ou clayette qui la ferme complètement ou munie d'un petit toit. Elle peut être à une ou deux places voire plus quand elle est destinée à la famille du pasteur tout entière.
in scheme: T69
related: T69-1001
scope note: Utiliser les termes en italique dans le champ PDEN.