arche sainte
terme associe: T69-1905
created: 2012-05-16T00:00:00+02:00
modified: 2014-01-10T00:00:00+01:00
status: 1
type: Concept
alternative label: armoire sainte
alternative label: aron ha-qodesh
broader: T69-1017
definition: Meuble dans lequel on place les rouleaux de la Torah. Portative à l'origine sous le nom de tiq, de Tevah (ou coffre), l'arche est devenue fixe et se trouve sur le mur faisant face à Jérusalem, point focal de la décoration dans les synagogues. L'arche sainte peut prendre la forme d'une véritable pièce où sont entreposés les rouleaux de Torah.
in scheme: T69
related: T69-1905
scope note: Préciser dans le champ PDEN la forme exacte de l'arche : coffre, armoire, pièce etc.