baldaquin de mariage
terme associe: T69-2447
created: 2012-05-16T00:00:00+02:00
modified: 2014-01-10T00:00:00+01:00
status: 1
type: Concept
alternative label: baldaquin nuptial
alternative label: baldaquin pour pupitre de Torah
broader: T69-1017
definition: Baldaquin dressé au-dessus de l'estrade pour pupitre de Torah lors des cérémonies du mariage et sous lequel se tiennent les mariés. Dans certaines synagogues, il peut être permanent. Le baldaquin est en matériau solide, du bois par exemple.
in scheme: T69
related: T69-2447
scope note: Quand il s'agit d'éléments textiles, employer dais de mariage dans le champ PDEN.