chaire à prêcher de synagogue
created: 2012-05-16T00:00:00+02:00
modified: 2014-01-10T00:00:00+01:00
status: 1
type: Concept
broader: T69-1017
definition: La chaire à prêcher destinée à l'officiant est d'une forme très proche de celle du culte catholique et apparaît dans les synagogues, au XIXe siècle, dans le cadre du courant réformiste et assimilateur.
in scheme: T69