fontaine d'ablutions
created: 2012-05-16T00:00:00+02:00
modified: 2014-01-10T00:00:00+01:00
status: 1
type: Concept
alternative label: fontaine de synagogue
alternative label: fontaine rituelle
broader: T69-1017
definition: Fontaine ou lavabo situé dans le vestibule de nombreuses synagogues afin que l'on puisse se laver les mains avant d'entrer dans le lieu de culte. En terre d'Islam, et par mimétisme avec la religion musulmane, on s'y lave parfois les pieds et les mains.
in scheme: T69