pupitre de Torah
created: 2012-05-16T00:00:00+02:00
modified: 2014-01-10T00:00:00+01:00
status: 1
type: Concept
alternative label: pupitre de Tora
broader: T69-1017
definition: Pupitre sur lequel on déroule la Torah pour la lecture du culte. Ce pupitre se situe soit sur la bimah, au centre de l'édifice et dans l'axe de l'arche, soit exactement sur le mur opposé à l'arche, à l'autre bout de la synagogue.
in scheme: T69