siège de synagogue
created: 2012-05-16T00:00:00+02:00
modified: 2014-01-10T00:00:00+01:00
status: 1
type: Concept
broader: T69-1017
definition: Siège placé dans la synagogue et destiné aux fidèles ou au rabin, qui peut avoir la forme d'un banc, d'une chaise, d'un fauteuil ou d'un tabouret.
in scheme: T69
narrower: T69-1057
narrower: T69-1059
narrower: T69-1062
narrower: T69-1064
narrower: T69-1066
scope note: On peut en préciser la forme exacte (banc, chaise, fauteuil, tabouret) dans le champ PDEN.