poteau
created: 2012-05-16T00:00:00+02:00
modified: 2014-12-15T16:06:41+01:00
status: 1
type: Concept
broader: T69-95
definition: Pièce maîtresse verticale d'une charpente.
in scheme: T69
preferred label: posts (structural elements) @en-us