fauteuil du prophète Elie
created: 2012-05-16T00:00:00+02:00
modified: 2014-01-10T00:00:00+01:00
status: 1
type: Concept
broader: T69-1055
definition: Fauteuil de petites dimensions ou de taille normale, sans usage effectif, parfois placé sur une console et qui symbolise la présence d'Elie dans le temple, en particulier lors des circoncisions auxquelles il préside en tant que protecteur des nourrissons et prophète de la circoncision.
in scheme: T69