siège de circoncision
created: 2012-05-16T00:00:00+02:00
modified: 2014-01-10T00:00:00+01:00
status: 1
type: Concept
broader: T69-1055
definition: Siège sur lequel s'assoit le parrain (sandaq) chargé de présenter l'enfant au circonciseur (mohèl). Ce siège peut être double, la deuxième place, symbolique, étant celle d'Elie, prophète présidant à la cérémonie et protecteur des nourrissons. Le dossier peut être orné de représentations des instruments du mohèl.
in scheme: T69