tronc de synagogue
created: 2012-05-16T00:00:00+02:00
modified: 2014-01-10T00:00:00+01:00
status: 1
type: Concept
broader: T69-1017
definition: Tronc que l'on trouve parfois accroché ou scellé au mur du vestibule d'une synagogue. Certains sont surmontés d'une main tendue. Ne pas confondre avec le tronc à quêter de la religion juive.
in scheme: T69