sablière
created: 2012-05-16T00:00:00+02:00
modified: 2014-12-15T16:25:05+01:00
status: 1
type: Concept
broader: T69-95
definition: Pièce maîtresse horizontale posée sur l'épaisseur d'un mur dans le même plan que celui-ci.
in scheme: T69
preferred label: wall plates (structural element components) @en-us