chandelier d'autel
terme associe: T69-1805
created: 2012-05-16T00:00:00+02:00
modified: 2014-11-27T12:57:51+01:00
status: 1
type: Concept
broader: T69-1115
definition: Chandelier à une seule lumière, posé sur l'autel ou sur les gradins d’autel. Assortis et disposés de part et d'autre du tabernacle, parfois de taille décroissante, les chandeliers d'autel sont utilisés en nombre variable selon les solennités (de deux à douze en général). Ils forment souvent un ensemble avec la croix d'autel, constituant une garniture d’autel.
in scheme: T69
narrower: T69-1133
preferred label: altar candlesticks @en-us
preferred label: candeliere d'altare @it
preferred label: castiçal de altar @pt
related: T69-1805