clochette d'autel
terme associe: T69-1115
created: 2012-05-16T00:00:00+02:00
modified: 2014-12-15T12:27:14+01:00
status: 1
type: Concept
broad match: http://data.bnf.fr/ark:/12148/cb122711462
broader: T69-4950
definition: Petite cloche portative, généralement en bronze, munie d'un manche ou d'une poignée, que le servant de messe agite pour marquer certains moments importants d'un office. Elle peut porter un décor religieux.
in scheme: T69
preferred label: altar handbells @en-us
preferred label: campanello d'altare @it
related: T69-1115