croix d'autel
terme associe: T69-1145
terme associe: T69-1645
created: 2012-05-16T00:00:00+02:00
modified: 2014-11-27T13:09:02+01:00
status: 1
type: Concept
alternative label: crucifix d'autel
broader: T69-1115
definition: Crucifix que l'on place au centre d’un autel, au-dessus du tabernacle, ou sur les gradins et formant généralement un ensemble avec les chandeliers d'autel, appelé garniture d’autel.
in scheme: T69
preferred label: altar crosses @en-us
preferred label: croce d'altare @it
preferred label: cruz de altar @pt
related: T69-1145
related: T69-1645