sonnette d'autel
terme associe: T69-1115
terme associe: T69-4946
terme associe: T69-4948
created: 2012-05-16T00:00:00+02:00
modified: 2014-12-15T12:28:59+01:00
status: 1
type: Concept
alternative label: carillon liturgique
broad match: cb11976117r
broader: T69-4950
definition: Instrument sonore à percussion constitué de plusieurs clochettes en métal, généralement en bronze et muni d'une poignée sur le dessus. La sonnette d'autel est actionnée par le servant de messe pour marquer certains moments importants d'un office.
in scheme: T69
preferred label: altar bells @en-us
preferred label: campanello d'altare multiplo @it
related: T69-1115
related: T69-4946
related: T69-4948