revêtement de sol
created: 2012-05-16T00:00:00+02:00
modified: 2015-01-30T11:39:26+01:00
status: 1
type: Concept
broader: T69-115
definition: Le terme désigne ce qui recouvre le sol, qu'il s'agisse de parquet, de pavement ou de toute autre mise enœuvre.
in scheme: T69
narrower: T69-120
narrower: T69-122
preferred label: floor coverings @en-us