boîte à hosties
terme associe: T69-1136
created: 2012-05-16T00:00:00+02:00
modified: 2014-11-27T13:44:07+01:00
status: 1
type: Concept
alternative label: boîte à pain d'autel
broader: T69-1173
definition: Récipient destiné à conserver les hosties non consacrées. Généralement de forme cylindrique, la boîte à hosties est toujours munie d'un couvercle qui peut parfois servir de baiser de paix, et porte alors un motif religieux. Les boîtes pour les grandes hosties peuvent comporter une plaque pesant sur ces dernières pour les maintenir en forme. Cette plaque est revêtue de soie blanche et munie d'un anneau de préhension.
in scheme: T69
preferred label: host boxes @en-us
preferred label: scatola per ostie @it
preferred label: caixa de hóstias @pt
related: T69-1136