boîte d'adoration
terme associe: T69-1210
created: 2012-05-16T00:00:00+02:00
modified: 2014-11-27T13:48:41+01:00
status: 1
type: Concept
alternative label: tabernacle de voyage
alternative label: tabernacle portatif
broader: T69-1173
definition: Boîte ouvrant par deux volets, comportant deux petits chandeliers d'applique et deux rideaux, employée pour le transport et l'exposition d'un ciboire là où il n'est pas possible d'utiliser un tabernacle posé sur un autel, souvent pour des célébrations en dehors des églises.
in scheme: T69
preferred label: portable tabernacles @en-us
preferred label: tabernacolo portatile @it
preferred label: sacrário portátil @pt
related: T69-1210