calice
terme associe: T69-1136
terme associe: T69-1471
terme associe: T69-2235
terme associe: T69-2240
terme associe: T69-2244
terme associe: T69-2252
terme associe: T69-2308
terme associe: T69-2580
created: 2012-05-16T00:00:00+02:00
modified: 2014-11-27T14:00:28+01:00
status: 1
type: Concept
alternative label: calice de voyage
alternative label: calice à anses
alternative label: calice à clochettes
broader: T69-1173
definition: Vase sacré dans lequel le célébrant consacre le vin pendant la messe. Il a la forme d'une coupe sur pied avec une tige comportant en général un nœud médian. Rituellement, la coupe, au moins, est en matériau précieux et, si elle n'est pas en or, l'intérieur doit en être doré ; elle est souvent doublée extérieurement d'une fausse-coupe, ajourée et indépendante. Le calice forme souvent un ensemble avec une patène et parfois un ciboire. Il existe quelques types rares de calice à anses, à clochettes.
in scheme: T69
narrower: T69-1200
narrower: T69-1202
narrower: T69-1204
preferred label: chalices (liturgical vessels) @en-us
preferred label: cálice @pt
related: T69-1136
related: T69-1471
related: T69-2235
related: T69-2240
related: T69-2244
related: T69-2252
related: T69-2308
related: T69-2580