parquet
created: 2012-05-16T00:00:00+02:00
modified: 2015-01-30T11:43:51+01:00
status: 1
type: Concept
broader: T69-118
definition: Aire de planches appelées lames, clouées et assemblées, soit directement sur les solives, soit, plus souvent, sur les lambourdes.
in scheme: T69
preferred label: parquetry @en-us