calice papal
created: 2012-05-16T00:00:00+02:00
modified: 2014-11-27T14:02:29+01:00
status: 1
type: Concept
broad match: http://vocab.getty.edu/aat/300194762
broader: T69-1195
definition: Rare type de calice réservé à la liturgie papale et caractérisé par la présence d'un couvercle.
in scheme: T69
preferred label: papal chalices @en-us
preferred label: calice papale @it
preferred label: cálice papal @pt