chalumeau eucharistique
terme associe: T69-1476
created: 2012-05-16T00:00:00+02:00
modified: 2014-11-27T14:35:55+01:00
status: 1
type: Concept
alternative label: chalumeau de communion
alternative label: chalumeau pour la communion
alternative label: fistule de communion
broad match: cb11936841q
broader: T69-1173
definition: Petit tuyau généralement en or ou argent utilisé dans la liturgie papale pour la communion sous l'espèce du vin. Il comporte parfois une petite poignée et une coupelle à la partie supérieure pour éviter le renversement du vin consacré. Il accompagnait un calice.
in scheme: T69
preferred label: fistulae @en-us
preferred label: fistola @it
preferred label: fístula eucarística @pt
related: T69-1476
scope note: Cet objet date de l'époque où l'on communiait sous les deux espèces.