couloire
created: 2012-05-16T00:00:00+02:00
modified: 2014-11-27T14:58:24+01:00
status: 1
type: Concept
alternative label: passoire liturgique
alternative label: passoire pour le vin de communion
broad match: cb11936841q
broader: T69-1173
definition: Passoire, généralement en forme de cuiller, pour filtrer le vin de messe, lorsqu'on le verse, avant sa consécration, dans le calice. Habituellement en or ou en argent, elle peut avoir un manche ou une anse en forme d'anneau. Les trous du cuilleron peuvent dessiner un symbole eucharistique.
in scheme: T69
preferred label: strainer spoons @en-us
preferred label: colatoio @it
preferred label: coador @pt