couteau eucharistique
created: 2012-05-16T00:00:00+02:00
modified: 2014-11-27T14:59:53+01:00
status: 1
type: Concept
alternative label: couteau à hosties
alternative label: couteau à pain bénit
alternative label: lance eucharistique
broader: T69-1173
definition: Ustensile ayant servi autrefois à couper en morceaux, avant sa consécration, le pain utilisé pour la communion.
in scheme: T69
preferred label: eucharistic knives @en-us
preferred label: coltello eucaristico @it
preferred label: faca eucarística @pt