cuiller eucharistique
created: 2012-05-16T00:00:00+02:00
modified: 2014-11-27T15:01:33+01:00
status: 1
type: Concept
alternative label: cuiller d'église
alternative label: cuiller de communion
alternative label: cuiller liturgique
alternative label: cuillère eucharistique
alternative label: louchette eucharistique
broad match: http://vocab.getty.edu/aat/300043149
broader: T69-1173
definition: Cuiller utilisée pendant la messe pour prendre l'eau de la burette à eau et la mêler au vin contenu dans le calice. Généralement en métal précieux (en or pour la liturgie pontificale), cette cuiller se distingue des cuillers ordinaires par le décor ou le motif religieux qu'elle porte. Elle peut prendre la forme d'une petite louche. Elle pouvait être utilisée exceptionnellement pour communier sous l'espèce du pain trempé dans du vin.
in scheme: T69
preferred label: liturgical spoons @en-us
preferred label: cucchiaio eucaristico @it
preferred label: colher eucarística @pt