croissant eucharistique
created: 2012-05-16T00:00:00+02:00
modified: 2014-11-27T15:11:42+01:00
status: 1
type: Concept
broad match: cb11936841q
broad match: Lunule (liturgie)
broad match: http://vocab.getty.edu/aat/300194500
broader: T69-1255
definition: Petit support en or ou en argent doré, constitué de deux plaques en forme de croissant entre lesquelles on insère l'hostie. On place ce support dans la partie centrale d'un ostensoir pour l'exposition d'une grande hostie consacrée. En dehors de l'exposition du saint sacrement, le croissant eucharistique est rangé dans une boîte à lunule ou placé sur un porte-lunule.
in scheme: T69
preferred label: crescent-shaped lunettes @en-us
preferred label: lunetta di ostensorio @it
preferred label: crescente eucarístico @pt